{"text_format":"1","workbook":"xlsx","n_sheets":4,"sheets":["LvB_PdC","PDF","Berekeningsbasis","Leidingen"],"not_rendered":{"charts":0,"images":10,"macros":1,"external_links":0,"defined_names":2,"comments":0,"pivot_tables":0},"unopened":[],"bounds":{"document_bytes":16777216,"sheet_cells":100000,"rows_first":2000,"rows_last":500,"rows_between":2000,"halvings":0,"cell_chars":16384,"cell_head_chars":4096},"cells_cut":0,"cells_raw":0,"read":"whole","date_system":"1900"}

{"sheet":"LvB_PdC","index":0,"n_rows":44,"n_cols":38,"rows_kept":44,"cut":false,"hidden":false,"merged":[[37,17,38,17],[37,15,38,16],[39,15,40,16],[39,7,40,14],[36,7,36,14],[37,7,38,14],[5,12,5,37],[25,4,26,4],[20,1,21,5],[25,1,26,3],[28,1,31,3],[28,4,29,4],[30,4,31,4],[22,5,23,5],[25,5,26,5],[28,5,29,5],[30,5,31,5],[0,0,0,37],[6,14,6,15],[6,16,6,17],[6,18,6,19],[6,34,6,35],[6,32,6,33],[6,20,6,21],[6,22,6,23],[6,24,6,25],[6,26,6,27],[1,1,1,3],[3,1,3,3],[6,28,6,29],[6,30,6,31],[6,12,6,13],[5,0,5,10],[36,1,36,5],[39,4,40,4],[20,7,21,17],[22,7,30,17],[37,4,38,4],[37,5,38,5],[39,5,40,5],[39,1,40,3],[37,1,38,3],[22,4,23,4],[22,1,23,3],[33,5,34,5],[33,4,34,4],[33,1,34,3],[33,7,34,17],[36,15,36,16]]}
["LEIDINGSVERLIESBEREKENING"]
["Project","Projet 1"]
[]
["Pomp referentie","Pomp(e) 1"]
[]
["LINAIRE LEIDINGSVERLIEZEN",null,null,null,null,null,null,null,null,null,null,null,"SINGULIERE LEIDINGSVERLIEZEN"]
["Sectie","Debiet","Lengte","Materiaal","Nominale Diameter","Debiet","Buiten- diameter","Binnen- diameter","Snelheid","Dp/m","Lineaire leidingsverliezen",null,"Koppeling",null,"Bocht 90° r/D=1,5",null,"Bocht 45° r/D=1,5",null,"T (in lijn)",null,"T (aftakking)",null,"Convergent",null,"Divergent",null,"Bol- of vlinderkraan",null,"Regelkraan (TA)",null,"Terugslag- klep",null,"Y Filter ",null,"Ontluchter & Vuilafscheider",null,"Divers","Singuliere leidingsverliezen"]
[null,"m³/h","m",null,"DN","l/min","mm","mm","m/s","Pa","Pa",null,"#","Pa","#","Pa","#","Pa","#","Pa","#","Pa","#","Pa","#","Pa","#","Pa","#","Pa","#","Pa","#","Pa","#","Pa","Pa","Pa"]
[null,40,20,"Verzinkt staal / Acier Galvanisé (Geberit Mapress)","108,0 x 2,0",666.4,108,104,1.3080180565091006,156.49307356078992,{"$f":"J9*C9","v":3129.8614712157987},null,4,187.8,10,2652,null,null,3,385,null,null,1,26,null,null,2,50.000000000000007,null,null,1,249.37309940681934,null,null,null,null,null,{"$f":"N9+P9+R9+T9+V9+X9+Z9+AB9+AD9+AF9+AH9+AJ9+AK9","v":3550.1730994068193}]
[null,3,20,"HDPE (Eupen Eucalene)","40 x 3,7",49.980000000000004,40,32.6,0.99840438804639076,345.75568391340579,{"$f":"J10*C10","v":6915.113678268116},null,null,null,3,449,null,null,null,null,null,null,null,null,null,null,null,null,null,null,null,null,null,null,null,null,null,449]
[null,null,null,"Koper / Cuivre (Geberit Mapress ; Sanco ; Wicu)","76,1 x 2,0",null,null,null,null,null,{"$f":"J11*C11","v":0},null,null,null,4,null,null,null,null,null,null,null,null,null,null,null,null,null,null,null,null,null,null,null,null,null,null,0]
[null,null,null,"PEX (Comap MultiSkin; Begetube Alpex; Henco)","50 x 4",null,null,null,null,null,0,null,null,null,null,null,null,null,null,null,null,null,null,null,null,null,null,null,null,null,null,null,null,null,null,null,null,0]
[null,null,null,"Inox (Geberit Mapress ; Viega 2205 & 2203)","54,0 x 1,5",null,null,null,null,null,0,null,null,null,2,null,null,null,null,null,null,null,null,null,null,null,null,null,null,null,null,null,null,null,null,null,null,0]
[null,null,null,"PEX (Comap MultiSkin; Begetube Alpex; Henco)","16 x 2",null,null,null,null,null,0,null,null,null,null,null,null,null,null,null,null,null,null,null,null,null,null,null,null,null,null,null,null,null,null,null,null,0]
[null,null,null,"PEX (Comap MultiSkin; Begetube Alpex; Henco)","16 x 2",null,null,null,null,null,0,null,null,null,null,null,null,null,null,null,null,null,null,null,null,null,null,null,null,null,null,null,null,null,null,null,null,0]
[null,null,null,"PEX (Comap MultiSkin; Begetube Alpex; Henco)","16 x 2",null,null,null,null,null,0,null,null,null,null,null,null,null,null,null,null,null,null,null,null,null,null,null,null,null,null,null,null,null,null,null,null,0]
[null,null,null,"PEX (Comap MultiSkin; Begetube Alpex; Henco)","16 x 2",null,null,null,null,null,0,null,null,null,null,null,null,null,null,null,null,null,null,null,null,null,null,null,null,null,null,null,null,null,null,null,null,0]
[null,null,null,"PEX (Comap MultiSkin; Begetube Alpex; Henco)","16 x 2",null,null,null,null,null,0,null,null,null,null,null,null,null,null,null,null,null,null,null,null,null,null,null,null,null,null,null,null,null,null,null,null,0]
[]
[]
[null,"TOTALE LEIDINGSVERLIEZEN",null,null,null,null,null,"OPMERKINGEN"]
[]
[null,"Totale liniaire leidingsverliezen",null,null,{"$f":"SUM(K9:K18)","v":10044.975149483915},"Pa"]
[]
[]
[null,"Totale singuliere leidingsverliezen",null,null,{"$f":"SUM(AL9:AL18)","v":3999.1730994068193},"Pa"]
[]
[]
[null,"Totale leidingsverliezen",null,null,{"$f":"E23+E26","v":14044.148248890735},"Pa"]
[]
[null,null,null,null,{"$f":"+E29:E29/10000","v":1.4044148248890735},"mWK"]
[]
[]
[null,"+25% Reserve",null,null,{"$f":"E31*1.25","v":1.7555185311113419},"mWK",null,"PARAMETERS"]
[]
[]
[null,"WERKINGSPUNT POMP",null,null,null,null,null,"Watertemperatuur [°]",null,null,null,null,null,null,null,20]
[null,"Verschildruk",null,null,{"$f":"E34","v":1.7555185311113419},"mWK",null,"Glycol [%]",null,null,null,null,null,null,null,0]
[]
[null,"Debiet",null,null,12,"m³/h",null,"Taal",null,null,null,null,null,null,null,"Nl"]
[]
[]
[]
["Deze berekeningstool kan worden gebruikt voor de berekening van leidingsverliezen in HVAC installaties. De berekeningsmethode wordt toegelicht in tab 'Berekeningsmethode'. Wilo kan niet aansprakelijk worden gesteld voor mogelijke tekortkomingen of fouten in de tool."]

{"sheet":"PDF","index":1,"n_rows":49,"n_cols":34,"rows_kept":49,"cut":false,"hidden":true,"merged":[[19,8,20,33],[21,8,33,33],[21,4,22,5],[24,4,25,5],[27,4,28,5],[24,6,25,6],[21,6,22,6],[27,6,28,6],[29,4,30,5],[29,6,30,6],[19,0,20,6],[21,0,22,3],[0,0,0,33],[5,8,5,33],[6,8,6,9],[6,10,6,11],[6,12,6,13],[6,14,6,15],[6,16,6,17],[6,30,6,31],[6,18,6,19],[6,20,6,21],[6,22,6,23],[6,24,6,25],[6,26,6,27],[6,28,6,29],[5,0,5,6],[1,1,1,5],[38,7,47,8],[41,0,42,6],[43,0,44,4],[43,5,44,5],[43,6,44,6],[38,5,39,5],[45,0,46,4],[45,5,46,5],[45,6,46,6],[38,6,39,6],[38,0,39,4],[36,6,37,6],[32,6,33,6],[35,0,35,6],[36,0,37,4],[3,1,3,5],[36,5,37,5],[32,5,33,5],[32,0,33,4],[27,0,30,3],[24,0,25,3]]}
[{"$f":"LvB_PdC!A1","v":"LEIDINGSVERLIESBEREKENING"}]
[{"$f":"LvB_PdC!A2","v":"Project"},{"$f":"LvB_PdC!B2","v":"Projet 1"}]
[]
[{"$f":"LvB_PdC!A4","v":"Pomp referentie"},{"$f":"LvB_PdC!B4","v":"Pomp(e) 1"}]
[]
[{"$f":"LvB_PdC!A6","v":"LINAIRE LEIDINGSVERLIEZEN"},null,null,null,null,null,null,null,{"$f":"LvB_PdC!M6","v":"SINGULIERE LEIDINGSVERLIEZEN"}]
[{"$f":"LvB_PdC!A7","v":"Sectie"},{"$f":"LvB_PdC!B7","v":"Debiet"},{"$f":"LvB_PdC!C7","v":"Lengte"},{"$f":"LvB_PdC!D7","v":"Materiaal"},{"$f":"LvB_PdC!E7","v":"Nominale Diameter"},{"$f":"LvB_PdC!J7","v":"Dp/m"},{"$f":"LvB_PdC!K7","v":"Lineaire leidingsverliezen"},null,{"$f":"LvB_PdC!M7","v":"Koppeling"},null,{"$f":"LvB_PdC!O7","v":"Bocht 90° r/D=1,5"},null,{"$f":"LvB_PdC!Q7","v":"Bocht 45° r/D=1,5"},null,{"$f":"LvB_PdC!S7","v":"T (in lijn)"},null,{"$f":"LvB_PdC!U7","v":"T (aftakking)"},null,{"$f":"LvB_PdC!W7","v":"Convergent"},null,{"$f":"LvB_PdC!Y7","v":"Divergent"},null,{"$f":"LvB_PdC!AA7","v":"Bol- of vlinderkraan"},null,{"$f":"LvB_PdC!AC7","v":"Regelkraan (TA)"},null,{"$f":"LvB_PdC!AE7","v":"Terugslag- klep"},null,{"$f":"LvB_PdC!AG7","v":"Y Filter "},null,{"$f":"LvB_PdC!AI7","v":"Ontluchter & Vuilafscheider"},null,{"$f":"LvB_PdC!AK7","v":"Divers"},{"$f":"LvB_PdC!AL7","v":"Singuliere leidingsverliezen"}]
[null,"m³/h","m",null,"DN","Pa","Pa",null,"#","Pa","#","Pa","#","Pa","#","Pa","#","Pa","#","Pa","#","Pa","#","Pa","#","Pa","#","Pa","#","Pa","#","Pa","Pa","Pa"]
[{"$f":"IF(ISBLANK(LvB_PdC!A9),\"\",LvB_PdC!A9)","v":""},{"$f":"IF(ISBLANK(LvB_PdC!B9),\"\",LvB_PdC!B9)","v":40},{"$f":"IF(ISBLANK(LvB_PdC!C9),\"\",LvB_PdC!C9)","v":20},{"$f":"IF(ISBLANK(LvB_PdC!B9),\"\",LvB_PdC!D9)","v":"Verzinkt staal / Acier Galvanisé (Geberit Mapress)"},{"$f":"IF(ISBLANK(LvB_PdC!B9),\"\",LvB_PdC!E9)","v":"108,0 x 2,0"},{"$f":"IF(ISBLANK(LvB_PdC!J9),\"\",LvB_PdC!J9)","v":156.49307356078992},{"$f":"IF(ISBLANK(LvB_PdC!B9),\"\",LvB_PdC!K9)","v":3129.8614712157987},null,{"$f":"IF(ISBLANK(LvB_PdC!M9),\"\",LvB_PdC!M9)","v":4},{"$f":"IF(ISBLANK(LvB_PdC!N9),\"\",LvB_PdC!N9)","v":187.8},{"$f":"IF(ISBLANK(LvB_PdC!O9),\"\",LvB_PdC!O9)","v":10},{"$f":"IF(ISBLANK(LvB_PdC!P9),\"\",LvB_PdC!P9)","v":2652},{"$f":"IF(ISBLANK(LvB_PdC!Q9),\"\",LvB_PdC!Q9)","v":""},{"$f":"IF(ISBLANK(LvB_PdC!R9),\"\",LvB_PdC!R9)","v":""},{"$f":"IF(ISBLANK(LvB_PdC!S9),\"\",LvB_PdC!S9)","v":3},{"$f":"IF(ISBLANK(LvB_PdC!T9),\"\",LvB_PdC!T9)","v":385},{"$f":"IF(ISBLANK(LvB_PdC!U9),\"\",LvB_PdC!U9)","v":""},{"$f":"IF(ISBLANK(LvB_PdC!V9),\"\",LvB_PdC!V9)","v":""},{"$f":"IF(ISBLANK(LvB_PdC!W9),\"\",LvB_PdC!W9)","v":1},{"$f":"IF(ISBLANK(LvB_PdC!X9),\"\",LvB_PdC!X9)","v":26},{"$f":"IF(ISBLANK(LvB_PdC!Y9),\"\",LvB_PdC!Y9)","v":""},{"$f":"IF(ISBLANK(LvB_PdC!Z9),\"\",LvB_PdC!Z9)","v":""},{"$f":"IF(ISBLANK(LvB_PdC!AA9),\"\",LvB_PdC!AA9)","v":2},{"$f":"IF(ISBLANK(LvB_PdC!AB9),\"\",LvB_PdC!AB9)","v":50.000000000000007},{"$f":"IF(ISBLANK(LvB_PdC!AC9),\"\",LvB_PdC!AC9)","v":""},{"$f":"IF(ISBLANK(LvB_PdC!AD9),\"\",LvB_PdC!AD9)","v":""},{"$f":"IF(ISBLANK(LvB_PdC!AE9),\"\",LvB_PdC!AE9)","v":1},{"$f":"IF(ISBLANK(LvB_PdC!AF9),\"\",LvB_PdC!AF9)","v":249.37309940681934},{"$f":"IF(ISBLANK(LvB_PdC!AG9),\"\",LvB_PdC!AG9)","v":""},{"$f":"IF(ISBLANK(LvB_PdC!AH9),\"\",LvB_PdC!AH9)","v":""},{"$f":"IF(ISBLANK(LvB_PdC!AI9),\"\",LvB_PdC!AI9)","v":""},{"$f":"IF(ISBLANK(LvB_PdC!AJ9),\"\",LvB_PdC!AJ9)","v":""},{"$f":"IF(ISBLANK(LvB_PdC!AK9),\"\",LvB_PdC!AK9)","v":""},{"$f":"IF(ISBLANK(LvB_PdC!B9),\"\",LvB_PdC!AL9)","v":3550.1730994068193}]
[{"$f":"IF(ISBLANK(LvB_PdC!A10),\"\",LvB_PdC!A10)","v":""},{"$f":"IF(ISBLANK(LvB_PdC!B10),\"\",LvB_PdC!B10)","v":3},{"$f":"IF(ISBLANK(LvB_PdC!C10),\"\",LvB_PdC!C10)","v":20},{"$f":"IF(ISBLANK(LvB_PdC!B10),\"\",LvB_PdC!D10)","v":"HDPE (Eupen Eucalene)"},{"$f":"IF(ISBLANK(LvB_PdC!B10),\"\",LvB_PdC!E10)","v":"40 x 3,7"},{"$f":"IF(ISBLANK(LvB_PdC!J10),\"\",LvB_PdC!J10)","v":345.75568391340579},{"$f":"IF(ISBLANK(LvB_PdC!B10),\"\",LvB_PdC!K10)","v":6915.113678268116},null,{"$f":"IF(ISBLANK(LvB_PdC!M10),\"\",LvB_PdC!M10)","v":""},{"$f":"IF(ISBLANK(LvB_PdC!N10),\"\",LvB_PdC!N10)","v":""},{"$f":"IF(ISBLANK(LvB_PdC!O10),\"\",LvB_PdC!O10)","v":3},{"$f":"IF(ISBLANK(LvB_PdC!P10),\"\",LvB_PdC!P10)","v":449},{"$f":"IF(ISBLANK(LvB_PdC!Q10),\"\",LvB_PdC!Q10)","v":""},{"$f":"IF(ISBLANK(LvB_PdC!R10),\"\",LvB_PdC!R10)","v":""},{"$f":"IF(ISBLANK(LvB_PdC!S10),\"\",LvB_PdC!S10)","v":""},{"$f":"IF(ISBLANK(LvB_PdC!T10),\"\",LvB_PdC!T10)","v":""},{"$f":"IF(ISBLANK(LvB_PdC!U10),\"\",LvB_PdC!U10)","v":""},{"$f":"IF(ISBLANK(LvB_PdC!V10),\"\",LvB_PdC!V10)","v":""},{"$f":"IF(ISBLANK(LvB_PdC!W10),\"\",LvB_PdC!W10)","v":""},{"$f":"IF(ISBLANK(LvB_PdC!X10),\"\",LvB_PdC!X10)","v":""},{"$f":"IF(ISBLANK(LvB_PdC!Y10),\"\",LvB_PdC!Y10)","v":""},{"$f":"IF(ISBLANK(LvB_PdC!Z10),\"\",LvB_PdC!Z10)","v":""},{"$f":"IF(ISBLANK(LvB_PdC!AA10),\"\",LvB_PdC!AA10)","v":""},{"$f":"IF(ISBLANK(LvB_PdC!AB10),\"\",LvB_PdC!AB10)","v":""},{"$f":"IF(ISBLANK(LvB_PdC!AC10),\"\",LvB_PdC!AC10)","v":""},{"$f":"IF(ISBLANK(LvB_PdC!AD10),\"\",LvB_PdC!AD10)","v":""},{"$f":"IF(ISBLANK(LvB_PdC!AE10),\"\",LvB_PdC!AE10)","v":""},{"$f":"IF(ISBLANK(LvB_PdC!AF10),\"\",LvB_PdC!AF10)","v":""},{"$f":"IF(ISBLANK(LvB_PdC!AG10),\"\",LvB_PdC!AG10)","v":""},{"$f":"IF(ISBLANK(LvB_PdC!AH10),\"\",LvB_PdC!AH10)","v":""},{"$f":"IF(ISBLANK(LvB_PdC!AI10),\"\",LvB_PdC!AI10)","v":""},{"$f":"IF(ISBLANK(LvB_PdC!AJ10),\"\",LvB_PdC!AJ10)","v":""},{"$f":"IF(ISBLANK(LvB_PdC!AK10),\"\",LvB_PdC!AK10)","v":""},{"$f":"IF(ISBLANK(LvB_PdC!B10),\"\",LvB_PdC!AL10)","v":449}]
[{"$f":"IF(ISBLANK(LvB_PdC!A11),\"\",LvB_PdC!A11)","v":""},{"$f":"IF(ISBLANK(LvB_PdC!B11),\"\",LvB_PdC!B11)","v":""},{"$f":"IF(ISBLANK(LvB_PdC!C11),\"\",LvB_PdC!C11)","v":""},{"$f":"IF(ISBLANK(LvB_PdC!B11),\"\",LvB_PdC!D11)","v":""},{"$f":"IF(ISBLANK(LvB_PdC!B11),\"\",LvB_PdC!E11)","v":""},{"$f":"IF(ISBLANK(LvB_PdC!J11),\"\",LvB_PdC!J11)","v":""},{"$f":"IF(ISBLANK(LvB_PdC!B11),\"\",LvB_PdC!K11)","v":""},null,{"$f":"IF(ISBLANK(LvB_PdC!M11),\"\",LvB_PdC!M11)","v":""},{"$f":"IF(ISBLANK(LvB_PdC!N11),\"\",LvB_PdC!N11)","v":""},{"$f":"IF(ISBLANK(LvB_PdC!O11),\"\",LvB_PdC!O11)","v":4},{"$f":"IF(ISBLANK(LvB_PdC!P11),\"\",LvB_PdC!P11)","v":""},{"$f":"IF(ISBLANK(LvB_PdC!Q11),\"\",LvB_PdC!Q11)","v":""},{"$f":"IF(ISBLANK(LvB_PdC!R11),\"\",LvB_PdC!R11)","v":""},{"$f":"IF(ISBLANK(LvB_PdC!S11),\"\",LvB_PdC!S11)","v":""},{"$f":"IF(ISBLANK(LvB_PdC!T11),\"\",LvB_PdC!T11)","v":""},{"$f":"IF(ISBLANK(LvB_PdC!U11),\"\",LvB_PdC!U11)","v":""},{"$f":"IF(ISBLANK(LvB_PdC!V11),\"\",LvB_PdC!V11)","v":""},{"$f":"IF(ISBLANK(LvB_PdC!W11),\"\",LvB_PdC!W11)","v":""},{"$f":"IF(ISBLANK(LvB_PdC!X11),\"\",LvB_PdC!X11)","v":""},{"$f":"IF(ISBLANK(LvB_PdC!Y11),\"\",LvB_PdC!Y11)","v":""},{"$f":"IF(ISBLANK(LvB_PdC!Z11),\"\",LvB_PdC!Z11)","v":""},{"$f":"IF(ISBLANK(LvB_PdC!AA11),\"\",LvB_PdC!AA11)","v":""},{"$f":"IF(ISBLANK(LvB_PdC!AB11),\"\",LvB_PdC!AB11)","v":""},{"$f":"IF(ISBLANK(LvB_PdC!AC11),\"\",LvB_PdC!AC11)","v":""},{"$f":"IF(ISBLANK(LvB_PdC!AD11),\"\",LvB_PdC!AD11)","v":""},{"$f":"IF(ISBLANK(LvB_PdC!AE11),\"\",LvB_PdC!AE11)","v":""},{"$f":"IF(ISBLANK(LvB_PdC!AF11),\"\",LvB_PdC!AF11)","v":""},{"$f":"IF(ISBLANK(LvB_PdC!AG11),\"\",LvB_PdC!AG11)","v":""},{"$f":"IF(ISBLANK(LvB_PdC!AH11),\"\",LvB_PdC!AH11)","v":""},{"$f":"IF(ISBLANK(LvB_PdC!AI11),\"\",LvB_PdC!AI11)","v":""},{"$f":"IF(ISBLANK(LvB_PdC!AJ11),\"\",LvB_PdC!AJ11)","v":""},{"$f":"IF(ISBLANK(LvB_PdC!AK11),\"\",LvB_PdC!AK11)","v":""},{"$f":"IF(ISBLANK(LvB_PdC!B11),\"\",LvB_PdC!AL11)","v":""}]
[{"$f":"IF(ISBLANK(LvB_PdC!A12),\"\",LvB_PdC!A12)","v":""},{"$f":"IF(ISBLANK(LvB_PdC!B12),\"\",LvB_PdC!B12)","v":""},{"$f":"IF(ISBLANK(LvB_PdC!C12),\"\",LvB_PdC!C12)","v":""},{"$f":"IF(ISBLANK(LvB_PdC!B12),\"\",LvB_PdC!D12)","v":""},{"$f":"IF(ISBLANK(LvB_PdC!B12),\"\",LvB_PdC!E12)","v":""},{"$f":"IF(ISBLANK(LvB_PdC!J12),\"\",LvB_PdC!J12)","v":""},{"$f":"IF(ISBLANK(LvB_PdC!B12),\"\",LvB_PdC!K12)","v":""},null,{"$f":"IF(ISBLANK(LvB_PdC!M12),\"\",LvB_PdC!M12)","v":""},{"$f":"IF(ISBLANK(LvB_PdC!N12),\"\",LvB_PdC!N12)","v":""},{"$f":"IF(ISBLANK(LvB_PdC!O12),\"\",LvB_PdC!O12)","v":""},{"$f":"IF(ISBLANK(LvB_PdC!P12),\"\",LvB_PdC!P12)","v":""},{"$f":"IF(ISBLANK(LvB_PdC!Q12),\"\",LvB_PdC!Q12)","v":""},{"$f":"IF(ISBLANK(LvB_PdC!R12),\"\",LvB_PdC!R12)","v":""},{"$f":"IF(ISBLANK(LvB_PdC!S12),\"\",LvB_PdC!S12)","v":""},{"$f":"IF(ISBLANK(LvB_PdC!T12),\"\",LvB_PdC!T12)","v":""},{"$f":"IF(ISBLANK(LvB_PdC!U12),\"\",LvB_PdC!U12)","v":""},{"$f":"IF(ISBLANK(LvB_PdC!V12),\"\",LvB_PdC!V12)","v":""},{"$f":"IF(ISBLANK(LvB_PdC!W12),\"\",LvB_PdC!W12)","v":""},{"$f":"IF(ISBLANK(LvB_PdC!X12),\"\",LvB_PdC!X12)","v":""},{"$f":"IF(ISBLANK(LvB_PdC!Y12),\"\",LvB_PdC!Y12)","v":""},{"$f":"IF(ISBLANK(LvB_PdC!Z12),\"\",LvB_PdC!Z12)","v":""},{"$f":"IF(ISBLANK(LvB_PdC!AA12),\"\",LvB_PdC!AA12)","v":""},{"$f":"IF(ISBLANK(LvB_PdC!AB12),\"\",LvB_PdC!AB12)","v":""},{"$f":"IF(ISBLANK(LvB_PdC!AC12),\"\",LvB_PdC!AC12)","v":""},{"$f":"IF(ISBLANK(LvB_PdC!AD12),\"\",LvB_PdC!AD12)","v":""},{"$f":"IF(ISBLANK(LvB_PdC!AE12),\"\",LvB_PdC!AE12)","v":""},{"$f":"IF(ISBLANK(LvB_PdC!AF12),\"\",LvB_PdC!AF12)","v":""},{"$f":"IF(ISBLANK(LvB_PdC!AG12),\"\",LvB_PdC!AG12)","v":""},{"$f":"IF(ISBLANK(LvB_PdC!AH12),\"\",LvB_PdC!AH12)","v":""},{"$f":"IF(ISBLANK(LvB_PdC!AI12),\"\",LvB_PdC!AI12)","v":""},{"$f":"IF(ISBLANK(LvB_PdC!AJ12),\"\",LvB_PdC!AJ12)","v":""},{"$f":"IF(ISBLANK(LvB_PdC!AK12),\"\",LvB_PdC!AK12)","v":""},{"$f":"IF(ISBLANK(LvB_PdC!B12),\"\",LvB_PdC!AL12)","v":""}]
[{"$f":"IF(ISBLANK(LvB_PdC!A13),\"\",LvB_PdC!A13)","v":""},{"$f":"IF(ISBLANK(LvB_PdC!B13),\"\",LvB_PdC!B13)","v":""},{"$f":"IF(ISBLANK(LvB_PdC!C13),\"\",LvB_PdC!C13)","v":""},{"$f":"IF(ISBLANK(LvB_PdC!B13),\"\",LvB_PdC!D13)","v":""},{"$f":"IF(ISBLANK(LvB_PdC!B13),\"\",LvB_PdC!E13)","v":""},{"$f":"IF(ISBLANK(LvB_PdC!J13),\"\",LvB_PdC!J13)","v":""},{"$f":"IF(ISBLANK(LvB_PdC!B13),\"\",LvB_PdC!K13)","v":""},null,{"$f":"IF(ISBLANK(LvB_PdC!M13),\"\",LvB_PdC!M13)","v":""},{"$f":"IF(ISBLANK(LvB_PdC!N13),\"\",LvB_PdC!N13)","v":""},{"$f":"IF(ISBLANK(LvB_PdC!O13),\"\",LvB_PdC!O13)","v":2},{"$f":"IF(ISBLANK(LvB_PdC!P13),\"\",LvB_PdC!P13)","v":""},{"$f":"IF(ISBLANK(LvB_PdC!Q13),\"\",LvB_PdC!Q13)","v":""},{"$f":"IF(ISBLANK(LvB_PdC!R13),\"\",LvB_PdC!R13)","v":""},{"$f":"IF(ISBLANK(LvB_PdC!S13),\"\",LvB_PdC!S13)","v":""},{"$f":"IF(ISBLANK(LvB_PdC!T13),\"\",LvB_PdC!T13)","v":""},{"$f":"IF(ISBLANK(LvB_PdC!U13),\"\",LvB_PdC!U13)","v":""},{"$f":"IF(ISBLANK(LvB_PdC!V13),\"\",LvB_PdC!V13)","v":""},{"$f":"IF(ISBLANK(LvB_PdC!W13),\"\",LvB_PdC!W13)","v":""},{"$f":"IF(ISBLANK(LvB_PdC!X13),\"\",LvB_PdC!X13)","v":""},{"$f":"IF(ISBLANK(LvB_PdC!Y13),\"\",LvB_PdC!Y13)","v":""},{"$f":"IF(ISBLANK(LvB_PdC!Z13),\"\",LvB_PdC!Z13)","v":""},{"$f":"IF(ISBLANK(LvB_PdC!AA13),\"\",LvB_PdC!AA13)","v":""},{"$f":"IF(ISBLANK(LvB_PdC!AB13),\"\",LvB_PdC!AB13)","v":""},{"$f":"IF(ISBLANK(LvB_PdC!AC13),\"\",LvB_PdC!AC13)","v":""},{"$f":"IF(ISBLANK(LvB_PdC!AD13),\"\",LvB_PdC!AD13)","v":""},{"$f":"IF(ISBLANK(LvB_PdC!AE13),\"\",LvB_PdC!AE13)","v":""},{"$f":"IF(ISBLANK(LvB_PdC!AF13),\"\",LvB_PdC!AF13)","v":""},{"$f":"IF(ISBLANK(LvB_PdC!AG13),\"\",LvB_PdC!AG13)","v":""},{"$f":"IF(ISBLANK(LvB_PdC!AH13),\"\",LvB_PdC!AH13)","v":""},{"$f":"IF(ISBLANK(LvB_PdC!AI13),\"\",LvB_PdC!AI13)","v":""},{"$f":"IF(ISBLANK(LvB_PdC!AJ13),\"\",LvB_PdC!AJ13)","v":""},{"$f":"IF(ISBLANK(LvB_PdC!AK13),\"\",LvB_PdC!AK13)","v":""},{"$f":"IF(ISBLANK(LvB_PdC!B13),\"\",LvB_PdC!AL13)","v":""}]
[{"$f":"IF(ISBLANK(LvB_PdC!A14),\"\",LvB_PdC!A14)","v":""},{"$f":"IF(ISBLANK(LvB_PdC!B14),\"\",LvB_PdC!B14)","v":""},{"$f":"IF(ISBLANK(LvB_PdC!C14),\"\",LvB_PdC!C14)","v":""},{"$f":"IF(ISBLANK(LvB_PdC!B14),\"\",LvB_PdC!D14)","v":""},{"$f":"IF(ISBLANK(LvB_PdC!B14),\"\",LvB_PdC!E14)","v":""},{"$f":"IF(ISBLANK(LvB_PdC!J14),\"\",LvB_PdC!J14)","v":""},{"$f":"IF(ISBLANK(LvB_PdC!B14),\"\",LvB_PdC!K14)","v":""},null,{"$f":"IF(ISBLANK(LvB_PdC!M14),\"\",LvB_PdC!M14)","v":""},{"$f":"IF(ISBLANK(LvB_PdC!N14),\"\",LvB_PdC!N14)","v":""},{"$f":"IF(ISBLANK(LvB_PdC!O14),\"\",LvB_PdC!O14)","v":""},{"$f":"IF(ISBLANK(LvB_PdC!P14),\"\",LvB_PdC!P14)","v":""},{"$f":"IF(ISBLANK(LvB_PdC!Q14),\"\",LvB_PdC!Q14)","v":""},{"$f":"IF(ISBLANK(LvB_PdC!R14),\"\",LvB_PdC!R14)","v":""},{"$f":"IF(ISBLANK(LvB_PdC!S14),\"\",LvB_PdC!S14)","v":""},{"$f":"IF(ISBLANK(LvB_PdC!T14),\"\",LvB_PdC!T14)","v":""},{"$f":"IF(ISBLANK(LvB_PdC!U14),\"\",LvB_PdC!U14)","v":""},{"$f":"IF(ISBLANK(LvB_PdC!V14),\"\",LvB_PdC!V14)","v":""},{"$f":"IF(ISBLANK(LvB_PdC!W14),\"\",LvB_PdC!W14)","v":""},{"$f":"IF(ISBLANK(LvB_PdC!X14),\"\",LvB_PdC!X14)","v":""},{"$f":"IF(ISBLANK(LvB_PdC!Y14),\"\",LvB_PdC!Y14)","v":""},{"$f":"IF(ISBLANK(LvB_PdC!Z14),\"\",LvB_PdC!Z14)","v":""},{"$f":"IF(ISBLANK(LvB_PdC!AA14),\"\",LvB_PdC!AA14)","v":""},{"$f":"IF(ISBLANK(LvB_PdC!AB14),\"\",LvB_PdC!AB14)","v":""},{"$f":"IF(ISBLANK(LvB_PdC!AC14),\"\",LvB_PdC!AC14)","v":""},{"$f":"IF(ISBLANK(LvB_PdC!AD14),\"\",LvB_PdC!AD14)","v":""},{"$f":"IF(ISBLANK(LvB_PdC!AE14),\"\",LvB_PdC!AE14)","v":""},{"$f":"IF(ISBLANK(LvB_PdC!AF14),\"\",LvB_PdC!AF14)","v":""},{"$f":"IF(ISBLANK(LvB_PdC!AG14),\"\",LvB_PdC!AG14)","v":""},{"$f":"IF(ISBLANK(LvB_PdC!AH14),\"\",LvB_PdC!AH14)","v":""},{"$f":"IF(ISBLANK(LvB_PdC!AI14),\"\",LvB_PdC!AI14)","v":""},{"$f":"IF(ISBLANK(LvB_PdC!AJ14),\"\",LvB_PdC!AJ14)","v":""},{"$f":"IF(ISBLANK(LvB_PdC!AK14),\"\",LvB_PdC!AK14)","v":""},{"$f":"IF(ISBLANK(LvB_PdC!B14),\"\",LvB_PdC!AL14)","v":""}]
[{"$f":"IF(ISBLANK(LvB_PdC!A15),\"\",LvB_PdC!A15)","v":""},{"$f":"IF(ISBLANK(LvB_PdC!B15),\"\",LvB_PdC!B15)","v":""},{"$f":"IF(ISBLANK(LvB_PdC!C15),\"\",LvB_PdC!C15)","v":""},{"$f":"IF(ISBLANK(LvB_PdC!B15),\"\",LvB_PdC!D15)","v":""},{"$f":"IF(ISBLANK(LvB_PdC!B15),\"\",LvB_PdC!E15)","v":""},{"$f":"IF(ISBLANK(LvB_PdC!J15),\"\",LvB_PdC!J15)","v":""},{"$f":"IF(ISBLANK(LvB_PdC!B15),\"\",LvB_PdC!K15)","v":""},null,{"$f":"IF(ISBLANK(LvB_PdC!M15),\"\",LvB_PdC!M15)","v":""},{"$f":"IF(ISBLANK(LvB_PdC!N15),\"\",LvB_PdC!N15)","v":""},{"$f":"IF(ISBLANK(LvB_PdC!O15),\"\",LvB_PdC!O15)","v":""},{"$f":"IF(ISBLANK(LvB_PdC!P15),\"\",LvB_PdC!P15)","v":""},{"$f":"IF(ISBLANK(LvB_PdC!Q15),\"\",LvB_PdC!Q15)","v":""},{"$f":"IF(ISBLANK(LvB_PdC!R15),\"\",LvB_PdC!R15)","v":""},{"$f":"IF(ISBLANK(LvB_PdC!S15),\"\",LvB_PdC!S15)","v":""},{"$f":"IF(ISBLANK(LvB_PdC!T15),\"\",LvB_PdC!T15)","v":""},{"$f":"IF(ISBLANK(LvB_PdC!U15),\"\",LvB_PdC!U15)","v":""},{"$f":"IF(ISBLANK(LvB_PdC!V15),\"\",LvB_PdC!V15)","v":""},{"$f":"IF(ISBLANK(LvB_PdC!W15),\"\",LvB_PdC!W15)","v":""},{"$f":"IF(ISBLANK(LvB_PdC!X15),\"\",LvB_PdC!X15)","v":""},{"$f":"IF(ISBLANK(LvB_PdC!Y15),\"\",LvB_PdC!Y15)","v":""},{"$f":"IF(ISBLANK(LvB_PdC!Z15),\"\",LvB_PdC!Z15)","v":""},{"$f":"IF(ISBLANK(LvB_PdC!AA15),\"\",LvB_PdC!AA15)","v":""},{"$f":"IF(ISBLANK(LvB_PdC!AB15),\"\",LvB_PdC!AB15)","v":""},{"$f":"IF(ISBLANK(LvB_PdC!AC15),\"\",LvB_PdC!AC15)","v":""},{"$f":"IF(ISBLANK(LvB_PdC!AD15),\"\",LvB_PdC!AD15)","v":""},{"$f":"IF(ISBLANK(LvB_PdC!AE15),\"\",LvB_PdC!AE15)","v":""},{"$f":"IF(ISBLANK(LvB_PdC!AF15),\"\",LvB_PdC!AF15)","v":""},{"$f":"IF(ISBLANK(LvB_PdC!AG15),\"\",LvB_PdC!AG15)","v":""},{"$f":"IF(ISBLANK(LvB_PdC!AH15),\"\",LvB_PdC!AH15)","v":""},{"$f":"IF(ISBLANK(LvB_PdC!AI15),\"\",LvB_PdC!AI15)","v":""},{"$f":"IF(ISBLANK(LvB_PdC!AJ15),\"\",LvB_PdC!AJ15)","v":""},{"$f":"IF(ISBLANK(LvB_PdC!AK15),\"\",LvB_PdC!AK15)","v":""},{"$f":"IF(ISBLANK(LvB_PdC!B15),\"\",LvB_PdC!AL15)","v":""}]
[{"$f":"IF(ISBLANK(LvB_PdC!A16),\"\",LvB_PdC!A16)","v":""},{"$f":"IF(ISBLANK(LvB_PdC!B16),\"\",LvB_PdC!B16)","v":""},{"$f":"IF(ISBLANK(LvB_PdC!C16),\"\",LvB_PdC!C16)","v":""},{"$f":"IF(ISBLANK(LvB_PdC!B16),\"\",LvB_PdC!D16)","v":""},{"$f":"IF(ISBLANK(LvB_PdC!B16),\"\",LvB_PdC!E16)","v":""},{"$f":"IF(ISBLANK(LvB_PdC!J16),\"\",LvB_PdC!J16)","v":""},{"$f":"IF(ISBLANK(LvB_PdC!B16),\"\",LvB_PdC!K16)","v":""},null,{"$f":"IF(ISBLANK(LvB_PdC!M16),\"\",LvB_PdC!M16)","v":""},{"$f":"IF(ISBLANK(LvB_PdC!N16),\"\",LvB_PdC!N16)","v":""},{"$f":"IF(ISBLANK(LvB_PdC!O16),\"\",LvB_PdC!O16)","v":""},{"$f":"IF(ISBLANK(LvB_PdC!P16),\"\",LvB_PdC!P16)","v":""},{"$f":"IF(ISBLANK(LvB_PdC!Q16),\"\",LvB_PdC!Q16)","v":""},{"$f":"IF(ISBLANK(LvB_PdC!R16),\"\",LvB_PdC!R16)","v":""},{"$f":"IF(ISBLANK(LvB_PdC!S16),\"\",LvB_PdC!S16)","v":""},{"$f":"IF(ISBLANK(LvB_PdC!T16),\"\",LvB_PdC!T16)","v":""},{"$f":"IF(ISBLANK(LvB_PdC!U16),\"\",LvB_PdC!U16)","v":""},{"$f":"IF(ISBLANK(LvB_PdC!V16),\"\",LvB_PdC!V16)","v":""},{"$f":"IF(ISBLANK(LvB_PdC!W16),\"\",LvB_PdC!W16)","v":""},{"$f":"IF(ISBLANK(LvB_PdC!X16),\"\",LvB_PdC!X16)","v":""},{"$f":"IF(ISBLANK(LvB_PdC!Y16),\"\",LvB_PdC!Y16)","v":""},{"$f":"IF(ISBLANK(LvB_PdC!Z16),\"\",LvB_PdC!Z16)","v":""},{"$f":"IF(ISBLANK(LvB_PdC!AA16),\"\",LvB_PdC!AA16)","v":""},{"$f":"IF(ISBLANK(LvB_PdC!AB16),\"\",LvB_PdC!AB16)","v":""},{"$f":"IF(ISBLANK(LvB_PdC!AC16),\"\",LvB_PdC!AC16)","v":""},{"$f":"IF(ISBLANK(LvB_PdC!AD16),\"\",LvB_PdC!AD16)","v":""},{"$f":"IF(ISBLANK(LvB_PdC!AE16),\"\",LvB_PdC!AE16)","v":""},{"$f":"IF(ISBLANK(LvB_PdC!AF16),\"\",LvB_PdC!AF16)","v":""},{"$f":"IF(ISBLANK(LvB_PdC!AG16),\"\",LvB_PdC!AG16)","v":""},{"$f":"IF(ISBLANK(LvB_PdC!AH16),\"\",LvB_PdC!AH16)","v":""},{"$f":"IF(ISBLANK(LvB_PdC!AI16),\"\",LvB_PdC!AI16)","v":""},{"$f":"IF(ISBLANK(LvB_PdC!AJ16),\"\",LvB_PdC!AJ16)","v":""},{"$f":"IF(ISBLANK(LvB_PdC!AK16),\"\",LvB_PdC!AK16)","v":""},{"$f":"IF(ISBLANK(LvB_PdC!B16),\"\",LvB_PdC!AL16)","v":""}]
[{"$f":"IF(ISBLANK(LvB_PdC!A17),\"\",LvB_PdC!A17)","v":""},{"$f":"IF(ISBLANK(LvB_PdC!B17),\"\",LvB_PdC!B17)","v":""},{"$f":"IF(ISBLANK(LvB_PdC!C17),\"\",LvB_PdC!C17)","v":""},{"$f":"IF(ISBLANK(LvB_PdC!B17),\"\",LvB_PdC!D17)","v":""},{"$f":"IF(ISBLANK(LvB_PdC!B17),\"\",LvB_PdC!E17)","v":""},{"$f":"IF(ISBLANK(LvB_PdC!J17),\"\",LvB_PdC!J17)","v":""},{"$f":"IF(ISBLANK(LvB_PdC!B17),\"\",LvB_PdC!K17)","v":""},null,{"$f":"IF(ISBLANK(LvB_PdC!M17),\"\",LvB_PdC!M17)","v":""},{"$f":"IF(ISBLANK(LvB_PdC!N17),\"\",LvB_PdC!N17)","v":""},{"$f":"IF(ISBLANK(LvB_PdC!O17),\"\",LvB_PdC!O17)","v":""},{"$f":"IF(ISBLANK(LvB_PdC!P17),\"\",LvB_PdC!P17)","v":""},{"$f":"IF(ISBLANK(LvB_PdC!Q17),\"\",LvB_PdC!Q17)","v":""},{"$f":"IF(ISBLANK(LvB_PdC!R17),\"\",LvB_PdC!R17)","v":""},{"$f":"IF(ISBLANK(LvB_PdC!S17),\"\",LvB_PdC!S17)","v":""},{"$f":"IF(ISBLANK(LvB_PdC!T17),\"\",LvB_PdC!T17)","v":""},{"$f":"IF(ISBLANK(LvB_PdC!U17),\"\",LvB_PdC!U17)","v":""},{"$f":"IF(ISBLANK(LvB_PdC!V17),\"\",LvB_PdC!V17)","v":""},{"$f":"IF(ISBLANK(LvB_PdC!W17),\"\",LvB_PdC!W17)","v":""},{"$f":"IF(ISBLANK(LvB_PdC!X17),\"\",LvB_PdC!X17)","v":""},{"$f":"IF(ISBLANK(LvB_PdC!Y17),\"\",LvB_PdC!Y17)","v":""},{"$f":"IF(ISBLANK(LvB_PdC!Z17),\"\",LvB_PdC!Z17)","v":""},{"$f":"IF(ISBLANK(LvB_PdC!AA17),\"\",LvB_PdC!AA17)","v":""},{"$f":"IF(ISBLANK(LvB_PdC!AB17),\"\",LvB_PdC!AB17)","v":""},{"$f":"IF(ISBLANK(LvB_PdC!AC17),\"\",LvB_PdC!AC17)","v":""},{"$f":"IF(ISBLANK(LvB_PdC!AD17),\"\",LvB_PdC!AD17)","v":""},{"$f":"IF(ISBLANK(LvB_PdC!AE17),\"\",LvB_PdC!AE17)","v":""},{"$f":"IF(ISBLANK(LvB_PdC!AF17),\"\",LvB_PdC!AF17)","v":""},{"$f":"IF(ISBLANK(LvB_PdC!AG17),\"\",LvB_PdC!AG17)","v":""},{"$f":"IF(ISBLANK(LvB_PdC!AH17),\"\",LvB_PdC!AH17)","v":""},{"$f":"IF(ISBLANK(LvB_PdC!AI17),\"\",LvB_PdC!AI17)","v":""},{"$f":"IF(ISBLANK(LvB_PdC!AJ17),\"\",LvB_PdC!AJ17)","v":""},{"$f":"IF(ISBLANK(LvB_PdC!AK17),\"\",LvB_PdC!AK17)","v":""},{"$f":"IF(ISBLANK(LvB_PdC!B17),\"\",LvB_PdC!AL17)","v":""}]
[{"$f":"IF(ISBLANK(LvB_PdC!A18),\"\",LvB_PdC!A18)","v":""},{"$f":"IF(ISBLANK(LvB_PdC!B18),\"\",LvB_PdC!B18)","v":""},{"$f":"IF(ISBLANK(LvB_PdC!C18),\"\",LvB_PdC!C18)","v":""},{"$f":"IF(ISBLANK(LvB_PdC!B18),\"\",LvB_PdC!D18)","v":""},{"$f":"IF(ISBLANK(LvB_PdC!B18),\"\",LvB_PdC!E18)","v":""},{"$f":"IF(ISBLANK(LvB_PdC!J18),\"\",LvB_PdC!J18)","v":""},{"$f":"IF(ISBLANK(LvB_PdC!B18),\"\",LvB_PdC!K18)","v":""},null,{"$f":"IF(ISBLANK(LvB_PdC!M18),\"\",LvB_PdC!M18)","v":""},{"$f":"IF(ISBLANK(LvB_PdC!N18),\"\",LvB_PdC!N18)","v":""},{"$f":"IF(ISBLANK(LvB_PdC!O18),\"\",LvB_PdC!O18)","v":""},{"$f":"IF(ISBLANK(LvB_PdC!P18),\"\",LvB_PdC!P18)","v":""},{"$f":"IF(ISBLANK(LvB_PdC!Q18),\"\",LvB_PdC!Q18)","v":""},{"$f":"IF(ISBLANK(LvB_PdC!R18),\"\",LvB_PdC!R18)","v":""},{"$f":"IF(ISBLANK(LvB_PdC!S18),\"\",LvB_PdC!S18)","v":""},{"$f":"IF(ISBLANK(LvB_PdC!T18),\"\",LvB_PdC!T18)","v":""},{"$f":"IF(ISBLANK(LvB_PdC!U18),\"\",LvB_PdC!U18)","v":""},{"$f":"IF(ISBLANK(LvB_PdC!V18),\"\",LvB_PdC!V18)","v":""},{"$f":"IF(ISBLANK(LvB_PdC!W18),\"\",LvB_PdC!W18)","v":""},{"$f":"IF(ISBLANK(LvB_PdC!X18),\"\",LvB_PdC!X18)","v":""},{"$f":"IF(ISBLANK(LvB_PdC!Y18),\"\",LvB_PdC!Y18)","v":""},{"$f":"IF(ISBLANK(LvB_PdC!Z18),\"\",LvB_PdC!Z18)","v":""},{"$f":"IF(ISBLANK(LvB_PdC!AA18),\"\",LvB_PdC!AA18)","v":""},{"$f":"IF(ISBLANK(LvB_PdC!AB18),\"\",LvB_PdC!AB18)","v":""},{"$f":"IF(ISBLANK(LvB_PdC!AC18),\"\",LvB_PdC!AC18)","v":""},{"$f":"IF(ISBLANK(LvB_PdC!AD18),\"\",LvB_PdC!AD18)","v":""},{"$f":"IF(ISBLANK(LvB_PdC!AE18),\"\",LvB_PdC!AE18)","v":""},{"$f":"IF(ISBLANK(LvB_PdC!AF18),\"\",LvB_PdC!AF18)","v":""},{"$f":"IF(ISBLANK(LvB_PdC!AG18),\"\",LvB_PdC!AG18)","v":""},{"$f":"IF(ISBLANK(LvB_PdC!AH18),\"\",LvB_PdC!AH18)","v":""},{"$f":"IF(ISBLANK(LvB_PdC!AI18),\"\",LvB_PdC!AI18)","v":""},{"$f":"IF(ISBLANK(LvB_PdC!AJ18),\"\",LvB_PdC!AJ18)","v":""},{"$f":"IF(ISBLANK(LvB_PdC!AK18),\"\",LvB_PdC!AK18)","v":""},{"$f":"IF(ISBLANK(LvB_PdC!B18),\"\",LvB_PdC!AL18)","v":""}]
[]
[{"$f":"IF(ISBLANK(LvB_PdC!B21),\"\",LvB_PdC!B21)","v":"TOTALE LEIDINGSVERLIEZEN"},null,null,null,null,null,null,null,{"$f":"IF(ISBLANK(LvB_PdC!H21),\"\",LvB_PdC!H21)","v":"OPMERKINGEN"}]
[]
[{"$f":"IF(ISBLANK(LvB_PdC!B23),\"\",LvB_PdC!B23)","v":"Totale liniaire leidingsverliezen"},null,null,null,{"$f":"SUM(G9:G18)","v":10044.975149483915},null,"Pa",null,{"$f":"IF(ISBLANK(LvB_PdC!H23),\"\",LvB_PdC!H23)","v":""}]
[]
[]
[{"$f":"IF(ISBLANK(LvB_PdC!B26),\"\",LvB_PdC!B26)","v":"Totale singuliere leidingsverliezen"},null,null,null,{"$f":"SUM(AH9:AH18)","v":3999.1730994068193},null,"Pa"]
[]
[]
[{"$f":"IF(ISBLANK(LvB_PdC!B29),\"\",LvB_PdC!B29)","v":"Totale leidingsverliezen"},null,null,null,{"$f":"E22+E25","v":14044.148248890735},null,"Pa"]
[]
[null,null,null,null,{"$f":"+E28:E28/10000","v":1.4044148248890735},null,"mCE"]
[]
[]
[{"$f":"IF(ISBLANK(LvB_PdC!B34),\"\",LvB_PdC!B34)","v":"+25% Reserve"},null,null,null,null,{"$f":"E30*1.25","v":1.7555185311113419},"mCE"]
[]
[]
[{"$f":"IF(ISBLANK(LvB_PdC!B37),\"\",LvB_PdC!B37)","v":"WERKINGSPUNT POMP"}]
[{"$f":"IF(ISBLANK(LvB_PdC!B38),\"\",LvB_PdC!B38)","v":"Verschildruk"},null,null,null,null,{"$f":"IF(ISBLANK(LvB_PdC!E38),\"\",LvB_PdC!E38)","v":1.7555185311113419},{"$f":"IF(ISBLANK(LvB_PdC!F38),\"\",LvB_PdC!F38)","v":"mWK"}]
[]
[{"$f":"IF(ISBLANK(LvB_PdC!B40),\"\",LvB_PdC!B40)","v":"Debiet"},null,null,null,null,{"$f":"IF(ISBLANK(LvB_PdC!E40),\"\",LvB_PdC!E40)","v":12},{"$f":"IF(ISBLANK(LvB_PdC!F40),\"\",LvB_PdC!F40)","v":"m³/h"}]
[]
[]
[{"$f":"IF(ISBLANK(LvB_PdC!H34),\"\",LvB_PdC!H34)","v":"PARAMETERS"}]
[]
[{"$f":"IF(ISBLANK(LvB_PdC!H37),\"\",LvB_PdC!H37)","v":"Watertemperatuur [°]"},null,null,null,null,{"$f":"IF(ISBLANK(LvB_PdC!P37),\"\",LvB_PdC!P37)","v":20}]
[]
[{"$f":"IF(ISBLANK(LvB_PdC!H38),\"\",LvB_PdC!H38)","v":"Glycol [%]"},null,null,null,null,{"$f":"IF(ISBLANK(LvB_PdC!P38),\"\",LvB_PdC!P38)","v":0}]
[]
[]
[{"$f":"IF(ISBLANK(LvB_PdC!A44),\"\",LvB_PdC!A44)","v":"Deze berekeningstool kan worden gebruikt voor de berekening van leidingsverliezen in HVAC installaties. De berekeningsmethode wordt toegelicht in tab 'Berekeningsmethode'. Wilo kan niet aansprakelijk worden gesteld voor mogelijke tekortkomingen of fouten in de tool."}]

{"sheet":"Berekeningsbasis","index":2,"n_rows":24,"n_cols":3,"rows_kept":24,"cut":false,"hidden":true,"merged":[]}
[]
[null,"Berekeningsbasis - Base de calcul"]
[null,"temperatuur","% glycol"]
[]
[null,10,0]
[null,20,0.1]
[null,30,0.15]
[null,40,0.2]
[null,50,0.25]
[null,60,0.3]
[null,70,0.35]
[null,80,0.4]
[null,90,0.45]
[null,100,0.5]
[]
[null,"Materials"]
[null,"PEX (Comap MultiSkin; Begetube Alpex; Henco)"]
[null,"PEX (Geberit Mepla)"]
[null,"HDPE (Geberit PEHD)"]
[null,"HDPE (Eupen Eucalene)"]
[null,"LDPE (Eupen Eucalene LDPE40)"]
[null,"Verzinkt staal / Acier Galvanisé (Geberit Mapress)"]
[null,"Inox (Geberit Mapress ; Viega 2205 & 2203)"]
[null,"Koper / Cuivre (Geberit Mapress ; Sanco ; Wicu)"]

{"sheet":"Leidingen","index":3,"n_rows":108,"n_cols":19,"rows_kept":108,"cut":false,"hidden":true,"merged":[[0,0,0,18],[93,0,93,18],[63,0,63,18],[78,0,78,18],[28,0,28,18],[16,0,16,18],[43,0,43,18],[53,0,53,18]]}
["PEX (Comap MultiSkin; Begetube Alpex; Henco)"]
["Nominale Diameter \nDiamètre nominal","Binnendiameter\nDiamètre intérieur","Buisdikte\nEpaisseur","Vmax ","Comment","Koppeling","Courbes 90° à souder r/D=1,5","Courbes 45° à souder r/D=1,5","Té (en ligne)","Té (branche)","Convergent","Divergent","Robinet à boule ou papillon","Robinet de règlage (TA)","Clapet de retenue","Filtre","ontluchter/\nvuilafscheider"]
[null,"A","n","(m/s)",null,"z","z","z","z","z","z","z","Kv","Pa","Kv","z","Kv","a","n"]
["12 x 1,6",8.8000000000000007,1.6,0.35,"De gewenste maximale watersnelheid is 0,4 m/s",{"$f":"F5*1.1","v":0.37400000000000005},1.7490000000000003,0.97900000000000009,0.49500000000000005,1.7490000000000003,0.6160000000000001,{"$f":"L5*1.1","v":0.6160000000000001},32,3000,4,2,93,154.46,1.7929999999999999]
["14 x 2",10,2,0.4,"De gewenste maximale watersnelheid is 0,4 m/s",0.34,1.59,0.89,0.45,1.59,0.56000000000000005,0.56000000000000005,32,3000,4,2,93,104,1.75]
["16 x 2",12,2,0.5,"De gewenste maximale watersnelheid is 0,4 m/s",0.34,1.35,0.89,0.45,1.59,0.56000000000000005,0.56000000000000005,32,3000,4,3,93,43.91,1.75]
["18 x 2",14,2,0.5,"De gewenste maximale watersnelheid is 0,4 m/s",0.34,1.44,0.89,0.45,1.59,0.56000000000000005,0.56000000000000005,32,3000,4,3.5,93,21.1,1.75]
["20 x 2",16,2,0.5,"De gewenste maximale watersnelheid is 0,4 m/s",0.26,1.44,0.89,0.33,1.41,0.56000000000000005,0.56000000000000005,32,3000,8,4,93,11.21,1.75]
["26 x 3",20,3,0.5,"De gewenste maximale watersnelheid is 0,42 m/s",0.43,1.44,0.89,0.54,1.51,0.56000000000000005,0.56000000000000005,36,3000,10.3,4.5,93,3.8919000000000001,1.75]
["32 x 3",26,3,0.6,"De gewenste maximale watersnelheid is 0,49 m/s",0.3,1.44,0.51,0.33,1.54,0.55000000000000004,0.55000000000000004,40,3000,24,5.0999999999999996,93,1.1279999999999999,1.75]
["40 x 3,5",33,3.5,0.7,"De gewenste maximale watersnelheid is 0,6 m/s",0.3,1.44,0.51,0.33,1.54,0.55000000000000004,0.55000000000000004,50,3000,32,5.0999999999999996,93,0.35880000000000001,1.75]
["50 x 4",42,4,0.8,"De gewenste maximale watersnelheid is 0,66 m/s",0.3,1.44,0.51,0.33,1.54,0.41,0.41,85,3000,40,5.0999999999999996,93,0.1114,1.75]
["63 x 4,5",54,4.5,0.9,"De gewenste maximale watersnelheid is 0,79 m/s",0.3,1.44,0.51,0.33,1.54,0.6,0.6,215,3000,72.5,5.0999999999999996,140,3.5200000000000002E-2,1.75]
["75 x 5",65,5,0.9,"De maximale watersnelheid kan verhoogd worden tot 1,2 m/s indien de buizen gelegen zijn in onbezette ruimten en indien er geen akoestische beperkingen van kracht zijn",0.3,1.44,0.51,0.33,1.54,0.49,0.49,215,3000,72.5,5.0999999999999996,140,1.49E-2,1.75]
["90 x 7",76,7,1,"De maximale watersnelheid kan verhoogd worden tot 1,2 m/s indien de buizen gelegen zijn in onbezette ruimten en indien er geen akoestische beperkingen van kracht zijn",0.32700000000000001,1.6659999999999999,0.61399999999999999,0.34699999999999998,1.8839999999999999,1.6,1.6,215,3000,72.5,5.0999999999999996,140,4.0299999999999997E-3,1.8129999999999999]
[]
["PEX (Geberit Mepla)"]
["Nominale Diameter \nDiamètre nominal","Binnendiameter\nDiamètre intérieur","Buisdikte\nEpaisseur","Vmax ","Comment","Koppeling","Courbes 90° à souder r/D=1,5","Courbes 45° à souder r/D=1,5","Té (en ligne)","Té (branche)","Convergent","Divergent","Robinet à boule ou papillon","Robinet de règlage (TA)","Clapet de retenue","Filtre","ontluchter/\nvuilafscheider"]
[null,"mm","mm","(m/s)",null,"z","z","z","z","z","z","z","Kv","Pa","Kv","z","Kv","a","n"]
["16 x 2,25",11.5,2.25,0.5,"De gewenste maximale watersnelheid is 0,4 m/s",2,3.45,{"$f":"G20/2","v":1.7250000000000001},3.1,4.5,0.85,0.85,32,3000,4,2,93,46.56,1.75]
["20 x 2,5",15,2.5,0.5,"De gewenste maximale watersnelheid is 0,4 m/s",1,2.1,{"$f":"G21/2","v":1.05},1.4,3.25,0.86,0.86,32,3000,4,2,93,13.23,1.75]
["26 x 3",20,3,0.5,"De gewenste maximale watersnelheid is 0,4 m/s",0.35,1.4,0.7,0.85,1.7,0.78,0.78,32,3000,8,3,93,3.1831999999999998,1.77]
["32 x 3",26,3,0.5,"De gewenste maximale watersnelheid is 0,42 m/s",0.25,1,0.5,0.55000000000000004,1.2,0.69,0.69,36,3000,10.3,3.5,93,0.92379999999999995,1.77]
["40 x 3,5",33,3.5,0.6,"De gewenste maximale watersnelheid is 0,49 m/s",0.2,0.8,0.4,0.4,0.85,0.64,0.64,40,3000,24,4,93,0.28999999999999998,1.77]
["50 x 4",42,4,0.7,"De gewenste maximale watersnelheid is 0,6 m/s",0.2,0.55000000000000004,0.27500000000000002,0.35,0.7,0.64,0.64,50,3000,32,4.5,93,8.5199999999999998E-2,1.79]
["63 x 4,5",54,4.5,0.8,"De gewenste maximale watersnelheid is 0,66 m/s",0.1,0.5,0.25,0.3,0.65,0.64,0.64,85,3000,40,5.0999999999999996,93,2.3099999999999999E-2,1.8147]
["75 x 4,7",65.599999999999994,4.7,0.9,"De gewenste maximale watersnelheid is 0,79 m/s",0.1,0.48,0.24,0.27,0.6,0.64,0.64,85,3000,40,5.0999999999999996,93,7.7999999999999996E-3,1.8387]
[]
["HDPE (Geberit PEHD)"]
["Nominale Diameter \nDiamètre nominal","Binnendiameter\nDiamètre intérieur","Buisdikte \nEpaisseur","Vmax ","Comment","Koppeling","Courbes 90° à souder r/D=1,5","Courbes 45° à souder r/D=1,5","Té (en ligne)","Té (branche)","Convergent","Divergent","Robinet à boule ou papillon","Robinet de règlage (TA)","Clapet de retenue","Filtre","ontluchter/\nvuilafscheider"]
[null,"mm","mm","(m/s)",null,"z","z","z","z","z","z","z","Kv","Pa","Kv","z","Kv","a","n"]
["30 x 3,0",26,3,0.6,"De gewenste maximale watersnelheid is 0,49 m/s",0.25,1,{"$f":"G32/2","v":0.5},0.55000000000000004,1.2,0.69,0.69,36,3000,10.3,3.5,93,{"$f":"7000000*B32^(-4.811)","v":1.090589376613563},1.75]
["40 x 3,0",34,3,0.7,"De gewenste maximale watersnelheid is 0,6 m/s",0.2,0.8,0.4,0.4,0.85,0.64,0.64,40,3000,24,4,93,{"$f":"7000000*B33^(-4.811)","v":0.30002190902512155},1.75]
["50 x 3,0",44,3,0.8,"De gewenste maximale watersnelheid is 0,66 m/s",0.2,0.55000000000000004,0.27500000000000002,0.35,0.7,0.64,0.64,50,3000,32,4.5,93,8.6785508695945132E-2,1.75]
["56 x 3,0",50,3,0.9,"De gewenste maximale watersnelheid is 0,79 m/s",0.1,0.5,0.25,0.3,0.65,0.64,0.64,85,3000,40,5.0999999999999996,93,4.6919497165823276E-2,1.75]
["60 x 3,0",57,3,0.9,"De maximale watersnelheid kan verhoogd worden tot 1,2 m/s indien de buizen gelegen zijn in onbezette ruimten en indien er geen akoestische beperkingen van kracht zijn",0.1,0.48,0.24,0.27,0.6,0.64,0.64,85,3000,40,5.0999999999999996,93,2.4979521181760854E-2,1.75]
["70 x 3,0",69,3,0.9,"De maximale watersnelheid kan verhoogd worden tot 1,2 m/s indien de buizen gelegen zijn in onbezette ruimten en indien er geen akoestische beperkingen van kracht zijn",0.1,0.48,0.24,0.27,0.6,0.64,0.64,420,3000,222,5.0999999999999996,209,9.9631131934900061E-3,1.75]
["90 x 3,5",83,3.5,0.9,"De maximale watersnelheid kan verhoogd worden tot 1,2 m/s indien de buizen gelegen zijn in onbezette ruimten en indien er geen akoestische beperkingen van kracht zijn",0.1,0.48,0.24,0.27,0.6,0.64,0.64,420,3000,222,5.0999999999999996,209,4.0965035692515171E-3,1.75]
["100 x 4,3",91.4,4.3,1,"De maximale watersnelheid kan verhoogd worden tot 1,2 m/s indien de buizen gelegen zijn in onbezette ruimten en indien er geen akoestische beperkingen van kracht zijn",0.1,0.48,0.24,0.27,0.6,0.64,0.64,800,3000,253.3,5.0999999999999996,311,2.5762374689125081E-3,1.75]
["125 x 4,9",115.2,4.9000000000000004,1,"De maximale watersnelheid kan verhoogd worden tot 1,2 m/s indien de buizen gelegen zijn in onbezette ruimten en indien er geen akoestische beperkingen van kracht zijn",0.1,0.48,0.24,0.27,0.6,0.64,0.64,1010,3000,302,5.0999999999999996,459,8.4615546381320509E-4,1.75]
["150 x 6,2",137.6,6.2,1,"De maximale watersnelheid kan verhoogd worden tot 1,2 m/s indien de buizen gelegen zijn in onbezette ruimten en indien er geen akoestische beperkingen van kracht zijn",0.1,0.48,0.24,0.27,0.6,0.64,0.64,2100,3000,370,5.0999999999999996,675,3.5991898426187494E-4,1.75]
["200 x 6,2",187.6,6.2,1,"De maximale watersnelheid kan verhoogd worden tot 1,2 m/s indien de buizen gelegen zijn in onbezette ruimten en indien er geen akoestische beperkingen van kracht zijn",0.1,0.48,0.24,0.27,0.6,0.64,0.64,4000,3000,430,5.0999999999999996,1340,8.1016760825264997E-5,1.75]
[]
["HDPE (Eupen Eucalene)"]
["Nominale Diameter \nDiamètre nominal","Binnendiameter\nDiamètre intérieur","Buisdikte \nEpaisseur","Vmax ","Comment","Koppeling","Courbes 90° à souder r/D=1,5","Courbes 45° à souder r/D=1,5","Té (en ligne)","Té (branche)","Convergent","Divergent","Robinet à boule ou papillon","Robinet de règlage (TA)","Clapet de retenue","Filtre","ontluchter/\nvuilafscheider"]
[null,"mm","mm","(m/s)",null,"z","z","z","z","z","z","z","Kv","Pa","Kv","z","Kv","a","n"]
["20 x 2",16,2,0.5,"De gewenste maximale watersnelheid is 0,4 m/s",0.26,0.26,1.44,0.89,0.33,1.41,0.56000000000000005,0.56000000000000005,32,8,5.0999999999999996,93,{"$f":"7000000*B47^(-4.811)","v":11.273968147213902},1.75]
["25 X 2,3",20.399999999999999,2.2999999999999998,0.5,"De gewenste maximale watersnelheid is 0,42 m/s",0.43,0.43,1.44,0.89,0.54,1.51,0.56000000000000005,0.56000000000000005,36,10.3,5.0999999999999996,93,{"$f":"7000000*B48^(-4.811)","v":3.5032191363676204},1.75]
["32 x 3",26,3,0.6,"De gewenste maximale watersnelheid is 0,49 m/s",0.3,0.3,1.44,0.51,0.33,1.54,0.55000000000000004,0.55000000000000004,40,24,5.0999999999999996,93,1.090589376613563,1.75]
["40 x 3,7",32.6,3.7,0.7,"De gewenste maximale watersnelheid is 0,6 m/s",0.3,0.3,1.44,0.51,0.33,1.54,0.55000000000000004,0.55000000000000004,50,32,5.0999999999999996,93,0.36728920661292164,1.75]
["50 x 4,6",40.799999999999997,4.5999999999999996,0.8,"De gewenste maximale watersnelheid is 0,66 m/s",0.3,0.3,1.44,0.51,0.33,1.54,0.41,0.41,85,40,5.0999999999999996,93,0.12479925574522975,1.75]
["63 x 5,8",51.4,5.8,0.9,"De gewenste maximale watersnelheid is 0,79 m/s",0.3,0.3,1.44,0.51,0.33,1.54,0.6,0.6,215,72.5,5.0999999999999996,140,4.1082273973661522E-2,1.75]
[]
["LDPE (Eupen Eucalene LDPE40)"]
["Nominale Diameter \nDiamètre nominal","Binnendiameter\nDiamètre intérieur","Buisdikte \nEpaisseur","Vmax ","Comment","Koppeling","Courbes 90° à souder r/D=1,5","Courbes 45° à souder r/D=1,5","Té (en ligne)","Té (branche)","Convergent","Divergent","Robinet à boule ou papillon","Robinet de règlage (TA)","Clapet de retenue","Filtre","ontluchter/\nvuilafscheider"]
[null,"mm","mm","(m/s)",null,"z","z","z","z","z","z","z","Kv","Pa","Kv","z","Kv","a","n"]
["1/2R",11.500000000000002,4.8,0.4,"De gewenste maximale watersnelheid is 0,4 m/s",0.26,1.44,0.89,0.33,1.41,0.56000000000000005,0.56000000000000005,32,3000,8,4,93,{"$f":"7000000*B57^(-4.811)","v":55.218007331491414},1.75]
["3/4R",17.899999999999999,4.8,0.5,"De gewenste maximale watersnelheid is 0,4 m/s",0.43,1.44,0.89,0.54,1.51,0.56000000000000005,0.56000000000000005,36,3000,10.3,4.5,93,{"$f":"7000000*B58^(-4.811)","v":6.570858393836529},1.75]
["1R",24.299999999999997,4.8,0.5,"De gewenste maximale watersnelheid is 0,42 m/s",0.3,1.44,0.51,0.33,1.54,0.55000000000000004,0.55000000000000004,40,3000,24,5.0999999999999996,93,1.5098932991304215,1.75]
["5/4R",31,5.5,0.6,"De gewenste maximale watersnelheid is 0,49 m/s",0.3,1.44,0.51,0.33,1.54,0.55000000000000004,0.55000000000000004,50,3000,32,5.0999999999999996,93,0.46790418648450355,1.75]
["6/4R",36.199999999999996,5.8,0.7,"De gewenste maximale watersnelheid is 0,6 m/s",0.3,1.44,0.51,0.33,1.54,0.41,0.41,85,3000,40,5.0999999999999996,93,0.22189683469979135,1.75]
["2R",48.9,7.3,0.8,"De gewenste maximale watersnelheid is 0,66 m/s",0.3,1.44,0.51,0.33,1.54,0.6,0.6,215,3000,72.5,5.0999999999999996,140,5.2219549252560192E-2,1.75]
[]
["Verzinkt staal / Acier Galvanisé (Geberit Mapress)"]
["Nominale Diameter \nDiamètre nominal","Binnendiameter\nDiamètre extérieur","Buisdikte\nEpaisseur","Vmax ","Comment","Koppeling","Courbes 90° à souder r/D=1,5","Courbes 45° à souder r/D=1,5","Té (en ligne)","Té (branche)","Convergent","Divergent","Robinet à boule ou papillon","Robinet de règlage (TA)","terugslagklep/\nclapet anti-retour","Filtre","ontluchter/\nvuilafscheider"]
[null,"mm","mm","(m/s)",null,"z","z","z","z","z","z","z","Kv","Pa","Kv","z","Kv","a","n"]
["12,0 x 1,0",10,1,0.35,"De gewenste maximale watersnelheid is 0,4 m/s",0.3,0.5,0.25,0.3,1,0.09,0.05,32,3000,4,2,93,148.44999999999999,1.7090000000000001]
["15,0 x 1,0",13,1,0.4,"De gewenste maximale watersnelheid is 0,4 m/s",0.3,0.5,0.25,0.3,1,0.09,0.05,32,3000,4,2,93,39.134,1.73377]
["18,0 x 1,0",16,1,0.5,"De gewenste maximale watersnelheid is 0,4 m/s",0.3,0.5,0.25,0.3,1,0.09,0.05,32,3000,4,2,93,13.83,1.7477]
["22,0 x 1,2",19.600000000000001,1.2,0.5,"De gewenste maximale watersnelheid is 0,42 m/s",0.3,0.5,0.22,0.28000000000000003,1,0.09,0.05,32,3000,8,3,93,5.274,1.7589999999999999]
["28,0 x 1,2",25.6,1.2,0.6,"De gewenste maximale watersnelheid is 0,49 m/s",0.3,0.43,0.22,0.26,1,0.09,0.05,36,3000,10.3,3.5,93,1.37,1.7709999999999999]
["35 x 1,5",32,1.5,0.7,"De gewenste maximale watersnelheid is 0,6 m/s",0.3,0.41,0.22,0.25,0.95,7.0000000000000007E-2,0.05,40,3000,24,4,93,0.41699999999999998,1.774]
["42,0 x 1,5",39,1.5,0.7,"De gewenste maximale watersnelheid is 0,66 m/s",0.3,0.4,0.21,0.23,0.9,0.05,0.03,50,3000,32,4.5,93,0.1547,1.7849999999999999]
["54,0 x 1,5",51,1.5,0.8,"De gewenste maximale watersnelheid is 0,79 m/s",0.3,0.38,0.2,0.2,0.84,0.06,0.04,85,3000,40,5.0999999999999996,93,4.1270000000000001E-2,1.79]
["76,1 x 2,0",72.099999999999994,2,0.8,"De maximale watersnelheid kan verhoogd worden tot 1,2 m/s indien de buizen gelegen zijn in onbezette ruimten en indien er geen akoestische beperkingen van kracht zijn",0.3,0.35,0.19,0.18,0.79,0.05,0.04,215,3000,72.5,5.8,140,7.3200000000000001E-3,1.7989999999999999]
["88,9 x 2,0",84.9,2,0.9,"De maximale watersnelheid kan verhoogd worden tot 1,2 m/s indien de buizen gelegen zijn in onbezette ruimten en indien er geen akoestische beperkingen van kracht zijn",0.3,0.34,0.18,0.17,0.76,0.03,0.03,420,3000,222,6.2,209,3.7200000000000002E-3,1.786]
["108,0 x 2,0",104,2,1,"De maximale watersnelheid kan verhoogd worden tot 1,2 m/s indien de buizen gelegen zijn in onbezette ruimten en indien er geen akoestische beperkingen van kracht zijn",0.3,0.31,0.18,0.15,0.7,0.03,0.03,800,3000,253.3,6.7,311,1.439E-3,1.7833000000000001]
[]
["Inox (Geberit Mapress ; Viega 2205 & 2203)"]
["Nominale Diameter \nDiamètre nominal","Binnendiameter\nDiamètre extérieur","Buisdikte\nEpaisseur","Vmax ","Comment","Koppeling","Courbes 90° à souder r/D=1,5","Courbes 45° à souder r/D=1,5","Té (en ligne)","Té (branche)","Convergent","Divergent","Robinet à boule ou papillon","Robinet de règlage (TA)","terugslagklep/\nclapet anti-retour","Filtre","ontluchter/\nvuilafscheider"]
[null,"mm","mm","(m/s)",null,"z","z","z","z","z","z","z","Kv","Pa","Kv","z","Kv","a","n"]
["12,0 x 1,0",10,1,0.35,"De gewenste maximale watersnelheid is 0,4 m/s",0.3,0.5,0.25,0.3,1,0.09,0.05,32,3000,4,2,93,80.369,1.8140000000000001]
["15,0 x 1,0",13,1,0.4,"De gewenste maximale watersnelheid is 0,4 m/s",0.3,0.5,0.25,0.3,1,0.09,0.05,32,3000,4,2,93,22.423999999999999,1.8160000000000001]
["18,0 x 1,0",16,1,0.5,"De gewenste maximale watersnelheid is 0,4 m/s",0.3,0.5,0.25,0.3,1,0.09,0.05,32,3000,4,2,93,8.0832999999999995,1.819]
["22,0 x 1,2",19.600000000000001,1.2,0.5,"De gewenste maximale watersnelheid is 0,42 m/s",0.3,0.5,0.22,0.28000000000000003,1,0.09,0.05,32,3000,8,3,93,3.1225000000000001,1.81]
["28,0 x 1,2",25.6,1.2,0.6,"De gewenste maximale watersnelheid is 0,49 m/s",0.3,0.43,0.22,0.26,1,0.09,0.05,36,3000,10.3,3.5,93,1.0209999999999999,1.77]
["35 x 1,5",32,1.5,0.7,"De gewenste maximale watersnelheid is 0,6 m/s",0.3,0.41,0.22,0.25,0.95,7.0000000000000007E-2,0.05,40,3000,24,4,93,0.23699999999999999,1.85]
["42,0 x 1,5",39,1.5,0.8,"De gewenste maximale watersnelheid is 0,66 m/s",0.3,0.4,0.21,0.23,0.9,0.05,0.03,50,3000,32,4.5,93,9.7600000000000006E-2,1.8360000000000001]
["54,0 x 1,5",51,1.5,0.8,"De gewenste maximale watersnelheid is 0,79 m/s",0.3,0.38,0.2,0.2,0.84,0.06,0.04,85,3000,40,5.0999999999999996,93,2.2599999999999999E-2,1.861]
["76,1 x 2,0",72.099999999999994,2,0.9,"De maximale watersnelheid kan verhoogd worden tot 1,2 m/s indien de buizen gelegen zijn in onbezette ruimten en indien er geen akoestische beperkingen van kracht zijn",0.3,0.35,0.19,0.18,0.79,0.05,0.04,215,3000,72.5,5.8,140,5.5999999999999999E-3,1.8129999999999999]
["88,9 x 2,0",84.9,2,0.9,"De maximale watersnelheid kan verhoogd worden tot 1,2 m/s indien de buizen gelegen zijn in onbezette ruimten en indien er geen akoestische beperkingen van kracht zijn",0.3,0.34,0.18,0.17,0.76,0.03,0.03,420,3000,222,6.2,209,2E-3,1.837]
["108,0 x 2,0",104,2,0.1,"De maximale watersnelheid kan verhoogd worden tot 1,2 m/s indien de buizen gelegen zijn in onbezette ruimten en indien er geen akoestische beperkingen van kracht zijn",0.3,0.31,0.18,0.15,0.7,0.03,0.03,800,3000,253.3,6.7,311,7.4899999999999999E-4,1.849]
[]
["Koper / Cuivre (Geberit Mapress ; Sanco ; Wicu)"]
["Nominale Diameter \nDiamètre nominal","Binnendiameter\nDiamètre intérieur","Buisdikte \nEpaisseur","Vmax ","Comment","Koppeling","Courbes 90° à souder r/D=1,5","Courbes 45° à souder r/D=1,5","Té (en ligne)","Té (branche)","Convergent","Divergent","Robinet à boule ou papillon","Robinet de règlage (TA)","Clapet de retenue","Filtre","ontluchter/\nvuilafscheider"]
[null,"mm","mm","(m/s)",null,"z","z","z","z","z","z","m","Kv","Pa","Kv","z","Kv","a","n"]
["12,0 x 1,0",10,1,0.35,"De gewenste maximale watersnelheid is 0,4 m/s",{"$f":"F98*1.1","v":1.0098},3.3770000000000002,1.6885000000000001,1.1286,3.0491999999999999,1.0483,{"$f":"L98*1.1","v":1.0483},32,3000,4,2,93,116.28,1.75]
["15,0 x 1,0",13,1,0.4,"De gewenste maximale watersnelheid is 0,4 m/s",0.91800000000000004,3.07,{"$f":"G98/2","v":1.5349999999999999},1.026,2.7719999999999998,0.95299999999999996,0.95299999999999996,32,3000,4,3,93,32.048000000000002,1.7628999999999999]
["18,0 x 1,0",16,1,0.5,"De gewenste maximale watersnelheid is 0,4 m/s",0.61,2.839,1.4195,0.73899999999999999,2.1259999999999999,0.72199999999999998,0.72199999999999998,32,3000,8,4,93,12.923,1.7397]
["22,0 x 1,0",20,1,0.5,"De gewenste maximale watersnelheid is 0,4 m/s",0.55900000000000005,1.87,0.93500000000000005,0.63900000000000001,1.89,0.83799999999999997,0.83799999999999997,36,3000,10.3,4.5,93,4.3613,1.748]
["28,0 x 1,5",25,1.5,0.5,"De gewenste maximale watersnelheid is 0,4 m/s",0.504,1.974,{"$f":"G101/2","v":0.98699999999999999},0.629,1.974,0.76500000000000001,0.76500000000000001,40,3000,24,5.0999999999999996,93,1.488,1.7524999999999999]
["35 x 1,5",32,1.5,0.5,"De gewenste maximale watersnelheid is 0,42 m/s",0.47199999999999998,1.9810000000000001,{"$f":"G102/2","v":0.99050000000000005},0.56200000000000006,1.8440000000000001,0.66900000000000004,0.66900000000000004,50,3000,32,5.0999999999999996,93,0.15740000000000001,1.7789999999999999]
["42,0 x 1,5",39,1.5,0.7,"De gewenste maximale watersnelheid is 0,6 m/s",0.34200000000000003,1.7529999999999999,0.69,0.40699999999999997,2,0.81299999999999994,0.81299999999999994,215,3000,72.5,5.0999999999999996,140,4.65E-2,1.784]
["54,0 x 2,0",50,2,0.8,"De gewenste maximale watersnelheid is 0,66 m/s",0.32700000000000001,1.6659999999999999,0.61399999999999999,0.34699999999999998,1.8839999999999999,0.68400000000000005,0.68400000000000005,85,3000,40,5.0999999999999996,93,4.65E-2,1.784]
["64,0 x 2,0",60,2,0.9,"De gewenste maximale watersnelheid is 0,79 m/s",0.32700000000000001,1.6659999999999999,0.61399999999999999,0.34699999999999998,1.8839999999999999,1.6,1.6,215,3000,72.5,5.0999999999999996,140,{"$f":"AVERAGE(R104,R106)","v":2.7150000000000001E-2},{"$f":"AVERAGE(S104,S106)","v":1.7865}]
["76,1 x 2,0",72.099999999999994,2,0.9,"De maximale watersnelheid kan verhoogd worden tot 1,2 m/s indien de buizen gelegen zijn in onbezette ruimten en indien er geen akoestische beperkingen van kracht zijn",0.32700000000000001,1.6659999999999999,0.61399999999999999,0.34699999999999998,1.8839999999999999,1.6,1.6,215,3000,72.5,5.0999999999999996,140,7.7999999999999996E-3,1.7889999999999999]
["88,9 x 2,0",84.99,2,0.9,"De maximale watersnelheid kan verhoogd worden tot 1,2 m/s indien de buizen gelegen zijn in onbezette ruimten en indien er geen akoestische beperkingen van kracht zijn",0.32700000000000001,1.6659999999999999,0.61399999999999999,0.34699999999999998,1.8839999999999999,1.6,1.6,215,3000,72.5,5.0999999999999996,140,3.4399999999999999E-3,1.7949999999999999]
["108,0 x 2,5",103,2.5,1,"De maximale watersnelheid kan verhoogd worden tot 1,2 m/s indien de buizen gelegen zijn in onbezette ruimten en indien er geen akoestische beperkingen van kracht zijn",0.32700000000000001,1.6659999999999999,0.61399999999999999,0.34699999999999998,1.8839999999999999,1.6,1.6,215,3000,72.5,5.0999999999999996,140,1.32E-3,1.7989999999999999]